Reaction Details
TargetHistone deacetylase 8
LigandBDBM50201999
Substrate/Competitorn/a
Meas. Tech.ChEBML_1623659
IC50 200±n/a nM
Citation Lee, HYChang, CYSu, CJHuang, HLMehndiratta, SChao, YHHsu, CMKumar, SSung, TYHuang, YZLi, YHYang, CRLiou, JP 2-(Phenylsulfonyl)quinoline N-hydroxyacrylamides as potent anticancer agents inhibiting histone deacetylase. Eur J Med Chem122:92-101 (2016) 
 
Histone deacetylase 8
Name:Histone deacetylase 8
Type:Enzyme
Mol. Mass.:41749.60
Organism:Homo sapiens (Human)
Description:Q9BY41
Residue:377
BDBM50201999
NameBDBM50201999
Synonyms:CHEMBL3925939
TypeSmall organic molecule
Emp. Form.C18H13FN2O4S
Mol. Mass.372.37
SMILESONC(=O)\C=C\c1cccc(c1)S(=O)(=O)c1ccc2cccc(F)c2n1