Reaction Details
TargetHistone deacetylase 1
LigandBDBM50202000
Substrate/Competitorn/a
Meas. Tech.ChEBML_1623646
IC50 14±n/a nM
Citation Lee, HYChang, CYSu, CJHuang, HLMehndiratta, SChao, YHHsu, CMKumar, SSung, TYHuang, YZLi, YHYang, CRLiou, JP 2-(Phenylsulfonyl)quinoline N-hydroxyacrylamides as potent anticancer agents inhibiting histone deacetylase. Eur J Med Chem122:92-101 (2016) 
 
Histone deacetylase 1
Name:Histone deacetylase 1
Type:Enzyme
Mol. Mass.:55090.27
Organism:Homo sapiens (Human)
Description:Q13547
Residue:482
BDBM50202000
NameBDBM50202000
Synonyms:CHEMBL3973951
TypeSmall organic molecule
Emp. Form.C18H14N2O4S
Mol. Mass.354.38
SMILESONC(=O)\C=C\c1cccc(c1)S(=O)(=O)c1ccc2ccccc2n1