Reaction Details
TargetHistone deacetylase 2
LigandBDBM50201999
Substrate/Competitorn/a
Meas. Tech.ChEBML_1623657
IC50 15±n/a nM
Citation Lee, HYChang, CYSu, CJHuang, HLMehndiratta, SChao, YHHsu, CMKumar, SSung, TYHuang, YZLi, YHYang, CRLiou, JP 2-(Phenylsulfonyl)quinoline N-hydroxyacrylamides as potent anticancer agents inhibiting histone deacetylase. Eur J Med Chem122:92-101 (2016) 
 
Histone deacetylase 2
Name:Histone deacetylase 2
Type:Chromatin regulator; hydrolase; repressor
Mol. Mass.:55356.54
Organism:Homo sapiens (Human)
Description:Q92769
Residue:488
BDBM50201999
NameBDBM50201999
Synonyms:CHEMBL3925939
TypeSmall organic molecule
Emp. Form.C18H13FN2O4S
Mol. Mass.372.37
SMILESONC(=O)\C=C\c1cccc(c1)S(=O)(=O)c1ccc2cccc(F)c2n1