Reaction Details
TargetC-C chemokine receptor type 3
LigandBDBM50202470
Substrate/Competitorn/a
Meas. Tech.ChEMBL_1624212 (CHEMBL3866624)
EC50 1400±n/a nM
Citation Morikawa, THachiman, IMatsuo, KNishida, ENinomiya, KHayakawa, TYoshie, OMuraoka, ONakayama, T Neolignans from the Arils of Myristica fragrans as Potent Antagonists of CC Chemokine Receptor 3. J Nat Prod79:2005-13 (2016) 
 
C-C chemokine receptor type 3
Name:C-C chemokine receptor type 3
Type:Enzyme
Mol. Mass.:41053.88
Organism:Homo sapiens (Human)
Description:P51677
Residue:355
BDBM50202470
NameBDBM50202470
Synonyms:CHEMBL3922119
TypeSmall organic molecule
Emp. Form.C24H30O7
Mol. Mass.430.4908
SMILESCOc1ccc(cc1OC)[C@@H](OC(C)=O)[C@H](C)Oc1c(OC)cc(CC=C)cc1OC