Reaction Details
TargetC-C chemokine receptor type 3
LigandBDBM50202471
Substrate/Competitorn/a
Meas. Tech.ChEMBL_1624212 (CHEMBL3866624)
EC50 1500±n/a nM
Citation Morikawa, THachiman, IMatsuo, KNishida, ENinomiya, KHayakawa, TYoshie, OMuraoka, ONakayama, T Neolignans from the Arils of Myristica fragrans as Potent Antagonists of CC Chemokine Receptor 3. J Nat Prod79:2005-13 (2016) 
 
C-C chemokine receptor type 3
Name:C-C chemokine receptor type 3
Type:Enzyme
Mol. Mass.:41053.88
Organism:Homo sapiens (Human)
Description:P51677
Residue:355
BDBM50202471
NameBDBM50202471
Synonyms:CHEMBL3949874
TypeSmall organic molecule
Emp. Form.C22H28O7
Mol. Mass.404.4535
SMILESCOc1cc(cc(OC)c1O)[C@H](O)[C@@H](C)Oc1c(OC)cc(CC=C)cc1OC