Reaction Details
TargetCannabinoid receptor 2
LigandBDBM50202526
Substrate/Competitorn/a
Meas. Tech.ChEMBL_1624520 (CHEMBL3866932)
Ki>10000±n/a nM
Citation Osman, NALigresti, AKlein, CDAllarà, MRabbito, ADi Marzo, VAbouzid, KAAbadi, AH Discovery of novel Tetrahydrobenzo[b]thiophene and pyrrole based scaffolds as potent and selective CB2 receptor ligands: The structural elements controlling binding affinity, selectivity and functionality. Eur J Med Chem122:619-634 (2016) 
 
Cannabinoid receptor 2
Name:Cannabinoid receptor 2
Type:G Protein-Coupled Receptor (GPCR)
Mol. Mass.:39690.94
Organism:Homo sapiens (Human)
Description:P34972
Residue:360
BDBM50202526
NameBDBM50202526
Synonyms:CHEMBL3938707
TypeSmall organic molecule
Emp. Form.C19H16ClNO4S2
Mol. Mass.421.918
SMILESCCOC(=O)c1cc(sc1NS(=O)(=O)c1ccc(Cl)cc1)-c1ccccc1