Reaction Details
TargetCannabinoid receptor 1
LigandBDBM50202533
Substrate/Competitorn/a
Meas. Tech.ChEMBL_1624519 (CHEMBL3866931)
Ki>10000±n/a nM
Citation Osman, NALigresti, AKlein, CDAllarà, MRabbito, ADi Marzo, VAbouzid, KAAbadi, AH Discovery of novel Tetrahydrobenzo[b]thiophene and pyrrole based scaffolds as potent and selective CB2 receptor ligands: The structural elements controlling binding affinity, selectivity and functionality. Eur J Med Chem122:619-634 (2016) 
 
Cannabinoid receptor 1
Name:Cannabinoid receptor 1
Type:G Protein-Coupled Receptor (GPCR)
Mol. Mass.:52868.96
Organism:Homo sapiens (Human)
Description:P21554
Residue:472
BDBM50202533
NameBDBM50202533
Synonyms:CHEMBL3935661
TypeSmall organic molecule
Emp. Form.C22H24N2O
Mol. Mass.332.4388
SMILESCCc1c(cc(C)n1-c1ccccc1)C(=O)NCCc1ccccc1