Reaction Details
TargetCannabinoid receptor 1
LigandBDBM50202521
Substrate/Competitorn/a
Meas. Tech.ChEMBL_1624519 (CHEMBL3866931)
Ki 1197±n/a nM
Citation Osman, NALigresti, AKlein, CDAllarà, MRabbito, ADi Marzo, VAbouzid, KAAbadi, AH Discovery of novel Tetrahydrobenzo[b]thiophene and pyrrole based scaffolds as potent and selective CB2 receptor ligands: The structural elements controlling binding affinity, selectivity and functionality. Eur J Med Chem122:619-634 (2016) 
 
Cannabinoid receptor 1
Name:Cannabinoid receptor 1
Type:G Protein-Coupled Receptor (GPCR)
Mol. Mass.:52868.96
Organism:Homo sapiens (Human)
Description:P21554
Residue:472
BDBM50202521
NameBDBM50202521
Synonyms:CHEMBL3962080
TypeSmall organic molecule
Emp. Form.C24H30N2O
Mol. Mass.362.5078
SMILESCCc1c(cc(C)n1-c1ccccc1)C(=O)NC12CC3CC(CC(C3)C1)C2