Reaction Details
TargetCannabinoid receptor 1
LigandBDBM50202536
Substrate/Competitorn/a
Meas. Tech.ChEMBL_1624519 (CHEMBL3866931)
Ki>10000±n/a nM
Citation Osman, NALigresti, AKlein, CDAllarà, MRabbito, ADi Marzo, VAbouzid, KAAbadi, AH Discovery of novel Tetrahydrobenzo[b]thiophene and pyrrole based scaffolds as potent and selective CB2 receptor ligands: The structural elements controlling binding affinity, selectivity and functionality. Eur J Med Chem122:619-634 (2016) 
 
Cannabinoid receptor 1
Name:Cannabinoid receptor 1
Type:G Protein-Coupled Receptor (GPCR)
Mol. Mass.:52868.96
Organism:Homo sapiens (Human)
Description:P21554
Residue:472
BDBM50202536
NameBDBM50202536
Synonyms:CHEMBL3943735
TypeSmall organic molecule
Emp. Form.C22H21NO3S
Mol. Mass.379.472
SMILESCCOC(=O)c1c(NC(=O)c2ccc3ccccc3c2)sc2CCCCc12