Reaction Details
TargetCannabinoid receptor 2
LigandBDBM50202539
Substrate/Competitorn/a
Meas. Tech.ChEMBL_1624520 (CHEMBL3866932)
Ki 57±n/a nM
Citation Osman, NALigresti, AKlein, CDAllarà, MRabbito, ADi Marzo, VAbouzid, KAAbadi, AH Discovery of novel Tetrahydrobenzo[b]thiophene and pyrrole based scaffolds as potent and selective CB2 receptor ligands: The structural elements controlling binding affinity, selectivity and functionality. Eur J Med Chem122:619-634 (2016) 
 
Cannabinoid receptor 2
Name:Cannabinoid receptor 2
Type:G Protein-Coupled Receptor (GPCR)
Mol. Mass.:39690.94
Organism:Homo sapiens (Human)
Description:P34972
Residue:360
BDBM50202539
NameBDBM50202539
Synonyms:CHEMBL3953330
TypeSmall organic molecule
Emp. Form.C24H22N2O
Mol. Mass.354.4443
SMILESCCc1c(cc(C)n1-c1ccccc1)C(=O)Nc1ccc2ccccc2c1