Reaction Details
TargetCannabinoid receptor 2
LigandBDBM50202541
Substrate/Competitorn/a
Meas. Tech.ChEMBL_1624520 (CHEMBL3866932)
Ki 171±n/a nM
Citation Osman, NALigresti, AKlein, CDAllarà, MRabbito, ADi Marzo, VAbouzid, KAAbadi, AH Discovery of novel Tetrahydrobenzo[b]thiophene and pyrrole based scaffolds as potent and selective CB2 receptor ligands: The structural elements controlling binding affinity, selectivity and functionality. Eur J Med Chem122:619-634 (2016) 
 
Cannabinoid receptor 2
Name:Cannabinoid receptor 2
Type:G Protein-Coupled Receptor (GPCR)
Mol. Mass.:39690.94
Organism:Homo sapiens (Human)
Description:P34972
Residue:360
BDBM50202541
NameBDBM50202541
Synonyms:CHEMBL3906742
TypeSmall organic molecule
Emp. Form.C20H26N2O
Mol. Mass.310.4332
SMILESCCc1c(cc(C)n1-c1ccccc1)C(=O)NC1CCCCC1