Reaction Details
TargetCannabinoid receptor 2
LigandBDBM50200170
Substrate/Competitorn/a
Meas. Tech.ChEMBL_1624520 (CHEMBL3866932)
Ki 1.8±n/a nM
Citation Osman, NALigresti, AKlein, CDAllarà, MRabbito, ADi Marzo, VAbouzid, KAAbadi, AH Discovery of novel Tetrahydrobenzo[b]thiophene and pyrrole based scaffolds as potent and selective CB2 receptor ligands: The structural elements controlling binding affinity, selectivity and functionality. Eur J Med Chem122:619-634 (2016) 
 
Cannabinoid receptor 2
Name:Cannabinoid receptor 2
Type:G Protein-Coupled Receptor (GPCR)
Mol. Mass.:39690.94
Organism:Homo sapiens (Human)
Description:P34972
Residue:360
BDBM50200170
NameBDBM50200170
Synonyms:5-(4-chloro-3-methyl-phenyl)-1-(4-methyl-benzyl)-1H-pyrazole-3-carboxylic acid ((1S,2S,4R)-1,3,3-trimethyl-bicyclo[2.2.1]hept-2-yl)-amide CHEMBL381791 | SR-144528
TypeSmall organic molecule
Emp. Form.C29H34ClN3O
Mol. Mass.476.053
SMILESCc1ccc(Cn2nc(cc2-c2ccc(Cl)c(C)c2)C(=O)N[C@H]2[C@@]3(C)CC[C@H](C3)C2(C)C)cc1