Reaction Details
TargetCannabinoid receptor 2
LigandBDBM50202520
Substrate/Competitorn/a
Meas. Tech.ChEMBL_1624520 (CHEMBL3866932)
Ki 60±n/a nM
Citation Osman, NALigresti, AKlein, CDAllarà, MRabbito, ADi Marzo, VAbouzid, KAAbadi, AH Discovery of novel Tetrahydrobenzo[b]thiophene and pyrrole based scaffolds as potent and selective CB2 receptor ligands: The structural elements controlling binding affinity, selectivity and functionality. Eur J Med Chem122:619-634 (2016) 
 
Cannabinoid receptor 2
Name:Cannabinoid receptor 2
Type:G Protein-Coupled Receptor (GPCR)
Mol. Mass.:39690.94
Organism:Homo sapiens (Human)
Description:P34972
Residue:360
BDBM50202520
NameBDBM50202520
Synonyms:CHEMBL3892329
TypeSmall organic molecule
Emp. Form.C24H19NO3S
Mol. Mass.401.478
SMILESCCOC(=O)c1cc(sc1NC(=O)c1cccc2ccccc12)-c1ccccc1