Reaction Details
TargetCannabinoid receptor 2
LigandBDBM50202542
Substrate/Competitorn/a
Meas. Tech.ChEMBL_1624520 (CHEMBL3866932)
Ki 800±n/a nM
Citation Osman, NALigresti, AKlein, CDAllarà, MRabbito, ADi Marzo, VAbouzid, KAAbadi, AH Discovery of novel Tetrahydrobenzo[b]thiophene and pyrrole based scaffolds as potent and selective CB2 receptor ligands: The structural elements controlling binding affinity, selectivity and functionality. Eur J Med Chem122:619-634 (2016) 
 
Cannabinoid receptor 2
Name:Cannabinoid receptor 2
Type:G Protein-Coupled Receptor (GPCR)
Mol. Mass.:39690.94
Organism:Homo sapiens (Human)
Description:P34972
Residue:360
BDBM50202542
NameBDBM50202542
Synonyms:CHEMBL3984867
TypeSmall organic molecule
Emp. Form.C21H21NO4S2
Mol. Mass.415.526
SMILESCCOC(=O)c1c(NS(=O)(=O)c2cccc3ccccc23)sc2CCCCc12