Reaction Details
TargetPhosphatidylinositol 4,5-bisphosphate 3-kinase catalytic subunit gamma isoform
LigandBDBM50202550
Substrate/Competitorn/a
Meas. Tech.ChEMBL_1624624 (CHEMBL3867036)
IC50 1.1±n/a nM
Citation Han, JChen, YYang, CLiu, TWang, MXu, HZhang, LZheng, CSong, YZhu, J Structure-based optimization leads to the discovery of NSC765844, a highly potent, less toxic and orally efficacious dual PI3K/mTOR inhibitor. Eur J Med Chem122:684-701 (2016) 
 
Phosphatidylinositol 4,5-bisphosphate 3-kinase catalytic subunit gamma isoform
Name:Phosphatidylinositol 4,5-bisphosphate 3-kinase catalytic subunit gamma isoform
Type:Enzyme Subunit
Mol. Mass.:126470.30
Organism:Homo sapiens (Human)
Description:P48736
Residue:1102
BDBM50202550
NameBDBM50202550
Synonyms:CHEMBL3905146
TypeSmall organic molecule
Emp. Form.C31H28F2N4O4S
Mol. Mass.590.64
SMILESCOc1ncc(cc1NS(=O)(=O)c1ccc(F)cc1F)-c1ccc2nccc(-c3ccc(CN(C)CCO)cc3)c2c1