Reaction Details
TargetHistamine H1 receptor
LigandBDBM50202730
Substrate/Competitorn/a
Meas. Tech.ChEMBL_1624854 (CHEMBL3867266)
Ki 3981±n/a nM
Citation Kuhne, SKooistra, AJBosma, RBortolato, AWijtmans, MVischer, HFMason, JSde Graaf, Cde Esch, IJLeurs, R Identification of Ligand Binding Hot Spots of the Histamine H J Med Chem59:9047-9061 (2016) 
 
Histamine H1 receptor
Name:Histamine H1 receptor
Type:G Protein-Coupled Receptor (GPCR)
Mol. Mass.:55808.72
Organism:Homo sapiens (Human)
Description:Cell pellets from SK-N-MC cells transfected with human H1 receptor were used in binding assay.
Residue:487
BDBM50202730
NameBDBM50202730
Synonyms:CHEMBL3904359 | EN300-33530
TypeSmall organic molecule
Emp. Form.C11H15NO
Mol. Mass.177.2429
SMILESC1CC(CCN1)Oc1ccccc1