Reaction Details
TargetMitogen-activated protein kinase 1
LigandBDBM50203119
Substrate/Competitorn/a
Meas. Tech.ChEMBL_1624949 (CHEMBL3867361)
IC50 634±n/a nM
Citation Rosse, G Macrocyclic Inhibitors of ERK2 Kinase. ACS Med Chem Lett7:1020-1021 (2016) 
 
Mitogen-activated protein kinase 1
Name:Mitogen-activated protein kinase 1
Type:Ser/Thr Protein Kinase
Mol. Mass.:41392.76
Organism:Homo sapiens (Human)
Description:P28482
Residue:360
BDBM50203119
NameBDBM50203119
Synonyms:CHEMBL3899948
TypeSmall organic molecule
Emp. Form.C22H25N5O2
Mol. Mass.391.4662
SMILESCCn1ncc2cc3NC(=O)N[C@@H](c4ccccc4)C(C)(C)OC\C=C/c(n3)c12