Reaction Details
TargetDihydrofolate reductase
LigandBDBM18512
Substrate/Competitorn/a
Meas. Tech.ChEMBL_1624961 (CHEMBL3867373)
IC50 4300±n/a nM
Citation Welsch, MEZhou, JGao, YYan, YPorter, GAgnihotri, GLi, YLu, HChen, ZThomas, SB Discovery of Potent and Selective Leads against ACS Med Chem Lett7:1124-1129 (2016) 
 
Dihydrofolate reductase
Name:Dihydrofolate reductase
Type:Enzyme
Mol. Mass.:21453.99
Organism:Homo sapiens (Human)
Description:Recombinant human DHFR.
Residue:187
BDBM18512
NameBDBM18512
Synonyms:5-(4-chlorophenyl)-6-ethylpyrimidine-2,4-diamine Pyrimethamine (Pyr) cid_4993
TypeSmall organic molecule
Emp. Form.C12H13ClN4
Mol. Mass.248.711
SMILESCCc1nc(N)nc(N)c1-c1ccc(Cl)cc1