Reaction Details
TargetAlpha-1D adrenergic receptor
LigandBDBM50198338
Substrate/Competitorn/a
Meas. Tech.ChEMBL_1625180 (CHEMBL3867649)
Ki 1.7±n/a nM
Citation Silva, ROde Oliveira, ASNunes Lemes, LFde Camargo Nascente, LCoelho do Nascimento Nogueira, PSilveira, ERBrand, GDVistoli, GCilia, APoggesi, EBuccioni, MMarucci, GBolognesi, MLRomeiro, LAS Synthesis and structure-activity relationships of novel arylpiperazines as potent antagonists ofa1-adrenoceptor. Eur J Med Chem122:601-610 (2016) 
 
Alpha-1D adrenergic receptor
Name:Alpha-1D adrenergic receptor
Type:Enzyme Catalytic Domain
Mol. Mass.:60485.82
Organism:Homo sapiens (Human)
Description:adrenergic Alpha1D ADRA1D HUMAN::P25100
Residue:572
BDBM50198338
NameBDBM50198338
Synonyms:CHEMBL3938038
TypeSmall organic molecule
Emp. Form.C22H28N2O3
Mol. Mass.368.4693
SMILESCC(C)Oc1ccccc1N1CCN(CCc2ccc3OCOc3c2)CC1