Reaction Details
TargetAlpha-1D adrenergic receptor
LigandBDBM50200566
Substrate/Competitorn/a
Meas. Tech.ChEMBL_1625180 (CHEMBL3867649)
Ki 0.602560±n/a nM
Citation Silva, ROde Oliveira, ASNunes Lemes, LFde Camargo Nascente, LCoelho do Nascimento Nogueira, PSilveira, ERBrand, GDVistoli, GCilia, APoggesi, EBuccioni, MMarucci, GBolognesi, MLRomeiro, LAS Synthesis and structure-activity relationships of novel arylpiperazines as potent antagonists ofa1-adrenoceptor. Eur J Med Chem122:601-610 (2016) 
 
Alpha-1D adrenergic receptor
Name:Alpha-1D adrenergic receptor
Type:Enzyme Catalytic Domain
Mol. Mass.:60485.82
Organism:Homo sapiens (Human)
Description:adrenergic Alpha1D ADRA1D HUMAN::P25100
Residue:572
BDBM50200566
NameBDBM50200566
Synonyms:CHEMBL3902626
TypeSmall organic molecule
Emp. Form.C22H30N2O3
Mol. Mass.370.4852
SMILESCCOc1ccccc1N1CCN(CCc2ccc(OC)c(OC)c2)CC1