Reaction Details
TargetAlpha-1A adrenergic receptor
LigandBDBM50200566
Substrate/Competitorn/a
Meas. Tech.ChEMBL_1625178 (CHEMBL3867647)
Ki 2.1±n/a nM
Citation Silva, ROde Oliveira, ASNunes Lemes, LFde Camargo Nascente, LCoelho do Nascimento Nogueira, PSilveira, ERBrand, GDVistoli, GCilia, APoggesi, EBuccioni, MMarucci, GBolognesi, MLRomeiro, LAS Synthesis and structure-activity relationships of novel arylpiperazines as potent antagonists ofa1-adrenoceptor. Eur J Med Chem122:601-610 (2016) 
 
Alpha-1A adrenergic receptor
Name:Alpha-1A adrenergic receptor
Type:Cell-surface receptors
Mol. Mass.:51511.67
Organism:Homo sapiens (Human)
Description:P35348
Residue:466
BDBM50200566
NameBDBM50200566
Synonyms:CHEMBL3902626
TypeSmall organic molecule
Emp. Form.C22H30N2O3
Mol. Mass.370.4852
SMILESCCOc1ccccc1N1CCN(CCc2ccc(OC)c(OC)c2)CC1