Reaction Details
TargetAlpha-1A adrenergic receptor
LigandBDBM50201789
Substrate/Competitorn/a
Meas. Tech.ChEMBL_1625178 (CHEMBL3867647)
Ki 2.8±n/a nM
Citation Silva, ROde Oliveira, ASNunes Lemes, LFde Camargo Nascente, LCoelho do Nascimento Nogueira, PSilveira, ERBrand, GDVistoli, GCilia, APoggesi, EBuccioni, MMarucci, GBolognesi, MLRomeiro, LAS Synthesis and structure-activity relationships of novel arylpiperazines as potent antagonists ofa1-adrenoceptor. Eur J Med Chem122:601-610 (2016) 
 
Alpha-1A adrenergic receptor
Name:Alpha-1A adrenergic receptor
Type:Cell-surface receptors
Mol. Mass.:51511.67
Organism:Homo sapiens (Human)
Description:P35348
Residue:466
BDBM50201789
NameBDBM50201789
Synonyms:CHEMBL3946843
TypeSmall organic molecule
Emp. Form.C22H30N2O2
Mol. Mass.354.4858
SMILESCOc1cccc(CCN2CCN(CC2)c2ccccc2OC(C)C)c1