Reaction Details
TargetAlpha-1B adrenergic receptor
LigandBDBM50393116
Substrate/Competitorn/a
Meas. Tech.ChEMBL_1625179 (CHEMBL3867648)
Ki 5.2±n/a nM
Citation Silva, ROde Oliveira, ASNunes Lemes, LFde Camargo Nascente, LCoelho do Nascimento Nogueira, PSilveira, ERBrand, GDVistoli, GCilia, APoggesi, EBuccioni, MMarucci, GBolognesi, MLRomeiro, LAS Synthesis and structure-activity relationships of novel arylpiperazines as potent antagonists ofa1-adrenoceptor. Eur J Med Chem122:601-610 (2016) 
 
Alpha-1B adrenergic receptor
Name:Alpha-1B adrenergic receptor
Type:Enzyme
Mol. Mass.:56862.13
Organism:Homo sapiens (Human)
Description:P35368
Residue:520
BDBM50393116
NameBDBM50393116
Synonyms:CHEMBL2153423
TypeSmall organic molecule
Emp. Form.C20H24N2O3
Mol. Mass.340.4162
SMILESCOc1ccccc1N1CCN(CCc2ccc3OCOc3c2)CC1