Reaction Details
TargetTyrosine-protein phosphatase non-receptor type 1
LigandBDBM50346601
Substrate/Competitorn/a
Meas. Tech.ChEMBL_1625484 (CHEMBL3867953)
IC50 2390000±n/a nM
Citation Meng, GZheng, MWang, MTong, JGe, WZhang, JZheng, ALi, JGao, LLi, J Design and synthesis of new potent PTP1B inhibitors with the skeleton of 2-substituted imino-3-substituted-5-heteroarylidene-1,3-thiazolidine-4-one: Part I. Eur J Med Chem122:756-769 (2016) 
 
Tyrosine-protein phosphatase non-receptor type 1
Name:Tyrosine-protein phosphatase non-receptor type 1
Type:Protein phosphatase
Mol. Mass.:49963.76
Organism:Homo sapiens (Human)
Description:Human recombinant GST-fusion PTP1B (1-435).
Residue:435
BDBM50346601
NameBDBM50346601
Synonyms:NSC-114945 Oleanolic acid US11660306, Example Oleanolic acid
TypeSmall organic molecule
Emp. Form.C30H48O3
Mol. Mass.456.7003
SMILESCC1(C)CC[C@@]2(CC[C@]3(C)C(=CC[C@@H]4[C@@]5(C)CC[C@H](O)C(C)(C)[C@@H]5CC[C@@]34C)[C@@H]2C1)C(O)=O