Reaction Details
TargetTyrosine-protein kinase JAK2
LigandBDBM50201907
Substrate/Competitorn/a
Meas. Tech.ChEMBL_1625594 (CHEMBL3868063)
IC50 0.700000±n/a nM
Citation Wang, YHuang, WXin, MChen, PGui, LZhao, XTang, FWang, JLiu, F Identification of 4-(2-furanyl)pyrimidin-2-amines as Janus kinase 2 inhibitors. Bioorg Med Chem25:75-83 (2017) 
 
Tyrosine-protein kinase JAK2
Name:Tyrosine-protein kinase JAK2
Type:Protein
Mol. Mass.:130684.68
Organism:Homo sapiens (Human)
Description:O60674
Residue:1132
BDBM50201907
NameBDBM50201907
Synonyms:CHEMBL3940537
TypeSmall organic molecule
Emp. Form.C23H27N5O4S
Mol. Mass.469.557
SMILESCc1cnc(Nc2ccc(cc2)N2CCOCC2)nc1-c1cc2CN(CCc2o1)S(C)(=O)=O