Reaction Details
TargetSteroid 21-hydroxylase
LigandBDBM50203338
Substrate/Competitorn/a
Meas. Tech.ChEMBL_1625605 (CHEMBL3868074)
IC50 1600±n/a nM
Citation Blass, BEIyer, PAbou-Gharbia, MChilders, WEGordon, JCRamanjulu, MMorton, GArumugam, PBoruwa, JEllingboe, JMitra, SNimmareddy, RRPaliwal, SRajasekhar, JShivakumar, SSrivastava, PTangirala, RSVenkataramanaiah, KYanamandra, M Design, synthesis, and evaluation of (2S,4R)-Ketoconazole sulfonamide analogs as potential treatments for Metabolic Syndrome. Bioorg Med Chem Lett26:5825-5829 (2016) 
 
Steroid 21-hydroxylase
Name:Steroid 21-hydroxylase
Type:PROTEIN
Mol. Mass.:55896.25
Organism:Homo sapiens (Human)
Description:ChEMBL_1498865
Residue:494
BDBM50203338
NameBDBM50203338
Synonyms:CHEMBL3983734
TypeSmall organic molecule
Emp. Form.C25H28Cl2N4O5S
Mol. Mass.567.485
SMILESCS(=O)(=O)N1CCN(CC1)c1ccc(OC[C@@H]2CO[C@](Cn3ccnc3)(O2)c2ccc(Cl)cc2Cl)cc1