Reaction Details
TargetSteroid 17-alpha-hydroxylase/17,20 lyase
LigandBDBM8610
Substrate/Competitorn/a
Meas. Tech.ChEMBL_1625603 (CHEMBL3868072)
IC50 1800±n/a nM
Citation Blass, BEIyer, PAbou-Gharbia, MChilders, WEGordon, JCRamanjulu, MMorton, GArumugam, PBoruwa, JEllingboe, JMitra, SNimmareddy, RRPaliwal, SRajasekhar, JShivakumar, SSrivastava, PTangirala, RSVenkataramanaiah, KYanamandra, M Design, synthesis, and evaluation of (2S,4R)-Ketoconazole sulfonamide analogs as potential treatments for Metabolic Syndrome. Bioorg Med Chem Lett26:5825-5829 (2016) 
 
Steroid 17-alpha-hydroxylase/17,20 lyase
Name:Steroid 17-alpha-hydroxylase/17,20 lyase
Type:Enzyme
Mol. Mass.:57382.42
Organism:Homo sapiens (Human)
Description:E.coli expressing human CYP17
Residue:508
BDBM8610
NameBDBM8610
Synonyms:1-[4-(4-{[(2R,4S)-2-(2,4-dichlorophenyl)-2-(1H-imidazol-1-ylmethyl)-1,3-dioxolan-4-yl]methoxy}phenyl)piperazin-1-yl]ethan-1-one CHEMBL75 Ketoconazole US9138393, Ketoconozole | US9144538, Ketoconozole
TypeSmall organic molecule
Emp. Form.C26H28Cl2N4O4
Mol. Mass.531.431
SMILES[H][C@]1(COc2ccc(cc2)N2CCN(CC2)C(C)=O)CO[C@@](Cn2ccnc2)(O1)c1ccc(Cl)cc1Cl