Reaction Details
TargetGlucocorticoid receptor
LigandBDBM50203438
Substrate/Competitorn/a
Meas. Tech.ChEMBL_1625692 (CHEMBL3868161)
IC50 1.4±n/a nM
Citation Hemmerling, MEdman, KLepistö, MEriksson, AIvanova, SDahmén, JRehwinkel, HBerger, MHendrickx, RDearman, MJensen, TJWissler, LHansson, T Discovery of indazole ethers as novel, potent, non-steroidal glucocorticoid receptor modulators. Bioorg Med Chem Lett26:5741-5748 (2016) 
 
Glucocorticoid receptor
Name:Glucocorticoid receptor
Type:Enzyme
Mol. Mass.:85656.87
Organism:Homo sapiens (Human)
Description:P04150
Residue:777
BDBM50203438
NameBDBM50203438
Synonyms:CHEMBL3977631
TypeSmall organic molecule
Emp. Form.C26H26FN3O5S2
Mol. Mass.543.63
SMILESC[C@H](NS(=O)(=O)C1CC1)[C@H](Oc1ccc2n(ncc2c1)-c1ccc(F)cc1)c1ccc(cc1)S(C)(=O)=O