Reaction Details
TargetGlucocorticoid receptor
LigandBDBM50203421
Substrate/Competitorn/a
Meas. Tech.ChEMBL_1625691 (CHEMBL3868160)
IC50 2.9±n/a nM
Citation Hemmerling, MEdman, KLepistö, MEriksson, AIvanova, SDahmén, JRehwinkel, HBerger, MHendrickx, RDearman, MJensen, TJWissler, LHansson, T Discovery of indazole ethers as novel, potent, non-steroidal glucocorticoid receptor modulators. Bioorg Med Chem Lett26:5741-5748 (2016) 
 
Glucocorticoid receptor
Name:Glucocorticoid receptor
Type:Enzyme
Mol. Mass.:85656.87
Organism:Homo sapiens (Human)
Description:P04150
Residue:777
BDBM50203421
NameBDBM50203421
Synonyms:CHEMBL3964502
TypeSmall organic molecule
Emp. Form.C25H24FN3O5S
Mol. Mass.497.539
SMILESC[C@H](NC(=O)CO)[C@H](Oc1ccc2n(ncc2c1)-c1ccc(F)cc1)c1ccc(cc1)S(C)(=O)=O