Reaction Details
TargetGlucocorticoid receptor
LigandBDBM50203430
Substrate/Competitorn/a
Meas. Tech.ChEMBL_1625692 (CHEMBL3868161)
IC50 0.080000±n/a nM
Citation Hemmerling, MEdman, KLepistö, MEriksson, AIvanova, SDahmén, JRehwinkel, HBerger, MHendrickx, RDearman, MJensen, TJWissler, LHansson, T Discovery of indazole ethers as novel, potent, non-steroidal glucocorticoid receptor modulators. Bioorg Med Chem Lett26:5741-5748 (2016) 
 
Glucocorticoid receptor
Name:Glucocorticoid receptor
Type:Enzyme
Mol. Mass.:85656.87
Organism:Homo sapiens (Human)
Description:P04150
Residue:777
BDBM50203430
NameBDBM50203430
Synonyms:CHEMBL3901719
TypeSmall organic molecule
Emp. Form.C28H30FN3O3
Mol. Mass.475.5545
SMILESCOc1cccc(c1)[C@@H](Oc1ccc2n(ncc2c1)-c1ccc(F)cc1)[C@H](C)NC(=O)C(C)(C)C