Reaction Details
TargetNeuronal acetylcholine receptor subunit alpha-3/beta-4
LigandBDBM50203717
Substrate/Competitorn/a
Meas. Tech.ChEMBL_1625850 (CHEMBL3868319)
Ki 147±n/a nM
Citation Bolchi, CBavo, FFumagalli, LGotti, CFasoli, FMoretti, MPallavicini, M Novel 5-substituted 3-hydroxyphenyl and 3-nitrophenyl ethers of S-prolinol asa4ß2-nicotinic acetylcholine receptor ligands. Bioorg Med Chem Lett26:5613-5617 (2016) 
 
Neuronal acetylcholine receptor subunit alpha-3/beta-4
Name:Neuronal acetylcholine receptor subunit alpha-3/beta-4
Type:n/a
Mol. Mass.:n/a
Description:ASSAY_ID of ChEMBL is 1970247
Components:This complex has 2 components.
Component 1
Name:Neuronal acetylcholine receptor subunit beta-4
Synonyms:ACHB4_HUMAN Cholinergic, Nicotinic Alpha6Beta3Beta4Alpha5 Nicotinic acetylcholine receptor alpha6/alpha3/beta4
Type:Enzyme Catalytic Domain
Mol. Mass.:56388.51
Organism:Homo sapiens (Human)
Description:Cholinergic, Nicotinic Alpha6Beta3Beta4Alpha5 0 HUMAN::P30926
Residue:498
Component 2
Name:Neuronal acetylcholine receptor subunit alpha-3
Synonyms:ACHA3_HUMAN Cholinergic, Nicotinic Alpha3Beta2 Cholinergic, Nicotinic Alpha3Beta4x NACHRA3 Neuronal acetylcholine receptor subunit alpha-3 nicotinic central
Type:Enzyme Catalytic Domain
Mol. Mass.:57479.03
Organism:Homo sapiens (Human)
Description:Cholinergic, Nicotinic Alpha3Beta2 0 HUMAN::P32297
Residue:505
BDBM50203717
NameBDBM50203717
Synonyms:CHEMBL3952327
TypeSmall organic molecule
Emp. Form.C12H16BrNO2
Mol. Mass.286.165
SMILESCN1CCC[C@H]1COc1cc(O)cc(Br)c1