Reaction Details
TargetNeuronal acetylcholine receptor subunit alpha-4/beta-2
LigandBDBM50203720
Substrate/Competitorn/a
Meas. Tech.ChEMBL_1625849 (CHEMBL3868318)
Ki 528±n/a nM
Citation Bolchi, CBavo, FFumagalli, LGotti, CFasoli, FMoretti, MPallavicini, M Novel 5-substituted 3-hydroxyphenyl and 3-nitrophenyl ethers of S-prolinol asa4ß2-nicotinic acetylcholine receptor ligands. Bioorg Med Chem Lett26:5613-5617 (2016) 
 
Neuronal acetylcholine receptor subunit alpha-4/beta-2
Name:Neuronal acetylcholine receptor subunit alpha-4/beta-2
Type:n/a
Mol. Mass.:n/a
Description:n/a
Components:This complex has 0 components.
Component 1
Name:Neuronal acetylcholine receptor subunit alpha-4
Synonyms:ACHA4_RAT Cholinergic, Nicotinic Alpha4Beta2 Chrna4 Neuronal acetylcholine receptor (alpha4beta2 nAChR) Neuronal acetylcholine receptor subunit alpha 4 beta 2 | Neuronal acetylcholine receptor subunit alpha-4
Type:Enzyme
Mol. Mass.:70196.44
Organism:Rattus norvegicus (Rat)
Description:P09483
Residue:630
Component 2
Name:Neuronal acetylcholine receptor subunit beta-2
Synonyms:ACHB2_RAT Chrnb2 Neuronal acetylcholine receptor non-alpha-1 chain
Type:Enzyme
Mol. Mass.:56910.32
Organism:Rattus norvegicus (Rat)
Description:P12390
Residue:500
BDBM50203720
NameBDBM50203720
Synonyms:CHEMBL3928806
TypeSmall organic molecule
Emp. Form.C18H21NO2
Mol. Mass.283.3648
SMILESCN1CCC[C@H]1COc1cc(O)cc(c1)-c1ccccc1