Reaction Details
TargetOrexin receptor type 2
LigandBDBM50384416
Substrate/Competitorn/a
Meas. Tech.ChEMBL_1625905 (CHEMBL3868374)
Ki 835±n/a nM
Citation Stump, CACooke, AJBruno, JCabalu, TDGotter, ALHarell, CMKuduk, SDMcDonald, TPO'Brien, JRenger, JJWilliams, PDWinrow, CJColeman, PJ Discovery of highly potent and selective orexin 1 receptor antagonists (1-SORAs) suitable for in vivo interrogation of orexin 1 receptor pharmacology. Bioorg Med Chem Lett26:5809-5814 (2016) 
 
Orexin receptor type 2
Name:Orexin receptor type 2
Type:Protein
Mol. Mass.:50710.53
Organism:Homo sapiens (Human)
Description:O43614
Residue:444
BDBM50384416
NameBDBM50384416
Synonyms:CHEMBL2111553 SB-334867
TypeSmall organic molecule
Emp. Form.C17H13N5O2
Mol. Mass.319.3174
SMILESCc1nc2ccc(NC(=O)Nc3ccnc4cccnc34)cc2o1