Reaction Details
TargetOrexin receptor type 2
LigandBDBM50203758
Substrate/Competitorn/a
Meas. Tech.ChEMBL_1625870 (CHEMBL3868339)
Ki 271±n/a nM
Citation Stump, CACooke, AJBruno, JCabalu, TDGotter, ALHarell, CMKuduk, SDMcDonald, TPO'Brien, JRenger, JJWilliams, PDWinrow, CJColeman, PJ Discovery of highly potent and selective orexin 1 receptor antagonists (1-SORAs) suitable for in vivo interrogation of orexin 1 receptor pharmacology. Bioorg Med Chem Lett26:5809-5814 (2016) 
 
Orexin receptor type 2
Name:Orexin receptor type 2
Type:Protein
Mol. Mass.:50710.53
Organism:Homo sapiens (Human)
Description:O43614
Residue:444
BDBM50203758
NameBDBM50203758
Synonyms:CHEMBL3892723
TypeSmall organic molecule
Emp. Form.C24H20F2N4O2
Mol. Mass.434.438
SMILESFC1(F)CCN(C[C@@H]1Oc1ccc2ccccc2n1)C(=O)c1ccccc1-n1cccn1