Reaction Details
TargetOrexin receptor type 2
LigandBDBM50203761
Substrate/Competitorn/a
Meas. Tech.ChEMBL_1625870 (CHEMBL3868339)
Ki 18±n/a nM
Citation Stump, CACooke, AJBruno, JCabalu, TDGotter, ALHarell, CMKuduk, SDMcDonald, TPO'Brien, JRenger, JJWilliams, PDWinrow, CJColeman, PJ Discovery of highly potent and selective orexin 1 receptor antagonists (1-SORAs) suitable for in vivo interrogation of orexin 1 receptor pharmacology. Bioorg Med Chem Lett26:5809-5814 (2016) 
 
Orexin receptor type 2
Name:Orexin receptor type 2
Type:Protein
Mol. Mass.:50710.53
Organism:Homo sapiens (Human)
Description:O43614
Residue:444
BDBM50203761
NameBDBM50203761
Synonyms:CHEMBL3891586
TypeSmall organic molecule
Emp. Form.C23H18ClN5O3
Mol. Mass.447.874
SMILESCOc1ccc(NC(=O)c2cc(cnc2-c2ccccn2)-c2cncc(Cl)c2)nc1OC