Reaction Details
TargetOrexin receptor type 2
LigandBDBM50203930
Substrate/Competitorn/a
Meas. Tech.ChEMBL_1625870 (CHEMBL3868339)
Ki>2633±n/a nM
Citation Stump, CACooke, AJBruno, JCabalu, TDGotter, ALHarell, CMKuduk, SDMcDonald, TPO'Brien, JRenger, JJWilliams, PDWinrow, CJColeman, PJ Discovery of highly potent and selective orexin 1 receptor antagonists (1-SORAs) suitable for in vivo interrogation of orexin 1 receptor pharmacology. Bioorg Med Chem Lett26:5809-5814 (2016) 
 
Orexin receptor type 2
Name:Orexin receptor type 2
Type:Protein
Mol. Mass.:50710.53
Organism:Homo sapiens (Human)
Description:O43614
Residue:444
BDBM50203930
NameBDBM50203930
Synonyms:CHEMBL3950125
TypeSmall organic molecule
Emp. Form.C22H20F2N2O2
Mol. Mass.382.4032
SMILESCc1ccccc1C(=O)N1CCC(F)(F)C(C1)Oc1ccc2ccccc2n1