Reaction Details
TargetStromelysin-2
LigandBDBM50102750
Substrate/Competitorn/a
Meas. Tech.ChEMBL_1625935 (CHEMBL3868404)
IC50 160±n/a nM
Citation Nara, HSato, KKaieda, AOki, HKuno, HSantou, TKanzaki, NTerauchi, JUchikawa, OKori, M Design, synthesis, and biological activity of novel, potent, and highly selective fused pyrimidine-2-carboxamide-4-one-based matrix metalloproteinase (MMP)-13 zinc-binding inhibitors. Bioorg Med Chem24:6149-6165 (2016) 
 
Stromelysin-2
Name:Stromelysin-2
Type:Enzyme
Mol. Mass.:54143.02
Organism:Homo sapiens (Human)
Description:P09238
Residue:476
BDBM50102750
NameBDBM50102750
Synonyms:CHEMBL3359091
TypeSmall organic molecule
Emp. Form.C26H22FN3O6
Mol. Mass.491.4678
SMILESCOc1cccc(CNC(=O)c2nc3ccc(F)c(OCCc4ccc(cc4)C(O)=O)c3c(=O)[nH]2)c1