Reaction Details
TargetStromelysin-1
LigandBDBM50203955
Substrate/Competitorn/a
Meas. Tech.ChEMBL_1625931 (CHEMBL3868400)
IC50 2400±n/a nM
Citation Nara, HSato, KKaieda, AOki, HKuno, HSantou, TKanzaki, NTerauchi, JUchikawa, OKori, M Design, synthesis, and biological activity of novel, potent, and highly selective fused pyrimidine-2-carboxamide-4-one-based matrix metalloproteinase (MMP)-13 zinc-binding inhibitors. Bioorg Med Chem24:6149-6165 (2016) 
 
Stromelysin-1
Name:Stromelysin-1
Type:Enzyme
Mol. Mass.:53973.13
Organism:Homo sapiens (Human)
Description: P08254
Residue:477
BDBM50203955
NameBDBM50203955
Synonyms:CHEMBL3978380
TypeSmall organic molecule
Emp. Form.C26H22N6O5S
Mol. Mass.530.555
SMILESO=C(NCc1cccc(c1)-c1ccc(CS(=O)(=O)Cc2n[nH]c(=O)[nH]2)cc1)c1nc2ccccc2c(=O)[nH]1