Reaction Details
TargetNeutrophil collagenase
LigandBDBM50203955
Substrate/Competitorn/a
Meas. Tech.ChEMBL_1625933 (CHEMBL3868402)
IC50 12±n/a nM
Citation Nara, HSato, KKaieda, AOki, HKuno, HSantou, TKanzaki, NTerauchi, JUchikawa, OKori, M Design, synthesis, and biological activity of novel, potent, and highly selective fused pyrimidine-2-carboxamide-4-one-based matrix metalloproteinase (MMP)-13 zinc-binding inhibitors. Bioorg Med Chem24:6149-6165 (2016) 
 
Neutrophil collagenase
Name:Neutrophil collagenase
Type:Enzyme
Mol. Mass.:53413.48
Organism:Homo sapiens (Human)
Description:P22894
Residue:467
BDBM50203955
NameBDBM50203955
Synonyms:CHEMBL3978380
TypeSmall organic molecule
Emp. Form.C26H22N6O5S
Mol. Mass.530.555
SMILESO=C(NCc1cccc(c1)-c1ccc(CS(=O)(=O)Cc2n[nH]c(=O)[nH]2)cc1)c1nc2ccccc2c(=O)[nH]1