Reaction Details
TargetStromelysin-2
LigandBDBM50203956
Substrate/Competitorn/a
Meas. Tech.ChEMBL_1625935 (CHEMBL3868404)
IC50 2.4±n/a nM
Citation Nara, HSato, KKaieda, AOki, HKuno, HSantou, TKanzaki, NTerauchi, JUchikawa, OKori, M Design, synthesis, and biological activity of novel, potent, and highly selective fused pyrimidine-2-carboxamide-4-one-based matrix metalloproteinase (MMP)-13 zinc-binding inhibitors. Bioorg Med Chem24:6149-6165 (2016) 
 
Stromelysin-2
Name:Stromelysin-2
Type:Enzyme
Mol. Mass.:54143.02
Organism:Homo sapiens (Human)
Description:P09238
Residue:476
BDBM50203956
NameBDBM50203956
Synonyms:CHEMBL3971135
TypeSmall organic molecule
Emp. Form.C27H26N4O6S
Mol. Mass.534.584
SMILESCC(C)[C@H](NS(=O)(=O)c1ccc(cc1)-c1cccc(CNC(=O)c2nc3ccccc3c(=O)[nH]2)c1)C(O)=O