Reaction Details
TargetStromelysin-2
LigandBDBM50203957
Substrate/Competitorn/a
Meas. Tech.ChEMBL_1625935 (CHEMBL3868404)
IC50 34±n/a nM
Citation Nara, HSato, KKaieda, AOki, HKuno, HSantou, TKanzaki, NTerauchi, JUchikawa, OKori, M Design, synthesis, and biological activity of novel, potent, and highly selective fused pyrimidine-2-carboxamide-4-one-based matrix metalloproteinase (MMP)-13 zinc-binding inhibitors. Bioorg Med Chem24:6149-6165 (2016) 
 
Stromelysin-2
Name:Stromelysin-2
Type:Enzyme
Mol. Mass.:54143.02
Organism:Homo sapiens (Human)
Description:P09238
Residue:476
BDBM50203957
NameBDBM50203957
Synonyms:CHEMBL3900916
TypeSmall organic molecule
Emp. Form.C30H23ClN6O5S2
Mol. Mass.647.124
SMILESClc1cccc(c1)-c1csc2nc([nH]c(=O)c12)C(=O)NCc1cccc(c1)-c1ccc(CS(=O)(=O)Cc2n[nH]c(=O)[nH]2)cc1