Reaction Details
TargetStromelysin-2
LigandBDBM50203958
Substrate/Competitorn/a
Meas. Tech.ChEMBL_1625935 (CHEMBL3868404)
IC50 820±n/a nM
Citation Nara, HSato, KKaieda, AOki, HKuno, HSantou, TKanzaki, NTerauchi, JUchikawa, OKori, M Design, synthesis, and biological activity of novel, potent, and highly selective fused pyrimidine-2-carboxamide-4-one-based matrix metalloproteinase (MMP)-13 zinc-binding inhibitors. Bioorg Med Chem24:6149-6165 (2016) 
 
Stromelysin-2
Name:Stromelysin-2
Type:Enzyme
Mol. Mass.:54143.02
Organism:Homo sapiens (Human)
Description:P09238
Residue:476
BDBM50203958
NameBDBM50203958
Synonyms:CHEMBL3965628
TypeSmall organic molecule
Emp. Form.C25H21ClN6O4S
Mol. Mass.536.99
SMILESClc1cccc(c1)-c1csc2nc([nH]c(=O)c12)C(=O)NCc1cccc(OCCCOc2nc[nH]n2)c1