Reaction Details
TargetDisintegrin and metalloproteinase domain-containing protein 17
LigandBDBM50025159
Substrate/Competitorn/a
Meas. Tech.ChEMBL_1625938 (CHEMBL3868407)
IC50>10000±n/a nM
Citation Nara, HSato, KKaieda, AOki, HKuno, HSantou, TKanzaki, NTerauchi, JUchikawa, OKori, M Design, synthesis, and biological activity of novel, potent, and highly selective fused pyrimidine-2-carboxamide-4-one-based matrix metalloproteinase (MMP)-13 zinc-binding inhibitors. Bioorg Med Chem24:6149-6165 (2016) 
 
Disintegrin and metalloproteinase domain-containing protein 17
Name:Disintegrin and metalloproteinase domain-containing protein 17
Type:Enzyme
Mol. Mass.:93007.89
Organism:Homo sapiens (Human)
Description:
Residue:824
BDBM50025159
NameBDBM50025159
Synonyms:CHEMBL3337869
TypeSmall organic molecule
Emp. Form.C17H15N3O3
Mol. Mass.309.3193
SMILESCOc1cccc(CNC(=O)c2nc3ccccc3c(=O)[nH]2)c1