Reaction Details
TargetMatrilysin
LigandBDBM50204002
Substrate/Competitorn/a
Meas. Tech.ChEMBL_1625932 (CHEMBL3868401)
IC50 30±n/a nM
Citation Nara, HSato, KKaieda, AOki, HKuno, HSantou, TKanzaki, NTerauchi, JUchikawa, OKori, M Design, synthesis, and biological activity of novel, potent, and highly selective fused pyrimidine-2-carboxamide-4-one-based matrix metalloproteinase (MMP)-13 zinc-binding inhibitors. Bioorg Med Chem24:6149-6165 (2016) 
 
Matrilysin
Name:Matrilysin
Type:Enzyme
Mol. Mass.:29681.54
Organism:Homo sapiens (Human)
Description:P09237
Residue:267
BDBM50204002
NameBDBM50204002
Synonyms:CHEMBL3889936
TypeSmall organic molecule
Emp. Form.C28H28N4O6S
Mol. Mass.548.61
SMILESCC(C)C(CS(=O)(=O)c1ccc(cc1)-c1cccc(CNC(=O)c2nc3ccccc3c(=O)[nH]2)c1)N(O)C=O