Reaction Details
TargetStromelysin-2
LigandBDBM50204007
Substrate/Competitorn/a
Meas. Tech.ChEMBL_1625935 (CHEMBL3868404)
IC50 930±n/a nM
Citation Nara, HSato, KKaieda, AOki, HKuno, HSantou, TKanzaki, NTerauchi, JUchikawa, OKori, M Design, synthesis, and biological activity of novel, potent, and highly selective fused pyrimidine-2-carboxamide-4-one-based matrix metalloproteinase (MMP)-13 zinc-binding inhibitors. Bioorg Med Chem24:6149-6165 (2016) 
 
Stromelysin-2
Name:Stromelysin-2
Type:Enzyme
Mol. Mass.:54143.02
Organism:Homo sapiens (Human)
Description:P09238
Residue:476
BDBM50204007
NameBDBM50204007
Synonyms:CHEMBL3926071
TypeSmall organic molecule
Emp. Form.C30H27N5O7
Mol. Mass.569.5647
SMILESCCOCCC1(Oc2ccc(cc2)-c2cccc(CNC(=O)c3nc4ccccc4c(=O)[nH]3)c2)C(=O)NC(=O)NC1=O