Reaction Details
TargetCollagenase 3
LigandBDBM50203963
Substrate/Competitorn/a
Meas. Tech.ChEMBL_1625928 (CHEMBL3868397)
IC50 0.190000±n/a nM
Citation Nara, HSato, KKaieda, AOki, HKuno, HSantou, TKanzaki, NTerauchi, JUchikawa, OKori, M Design, synthesis, and biological activity of novel, potent, and highly selective fused pyrimidine-2-carboxamide-4-one-based matrix metalloproteinase (MMP)-13 zinc-binding inhibitors. Bioorg Med Chem24:6149-6165 (2016) 
 
Collagenase 3
Name:Collagenase 3
Type:Enzyme
Mol. Mass.:53808.06
Organism:Homo sapiens (Human)
Description:P45452
Residue:471
BDBM50203963
NameBDBM50203963
Synonyms:CHEMBL3907881
TypeSmall organic molecule
Emp. Form.C25H25N7O5
Mol. Mass.503.5099
SMILESO=C(CC1NC(=O)NC1=O)N1CCN(CC1)c1cccc(CNC(=O)c2nc3ccccc3c(=O)[nH]2)c1