Reaction Details
TargetOxysterols receptor LXR-alpha
LigandBDBM50204074
Substrate/Competitorn/a
Meas. Tech.ChEMBL_1626049 (CHEMBL3868518)
EC50 8.0±n/a nM
Citation Kick, EKBusch, BBMartin, RStevens, WCBollu, VXie, YBoren, BCNyman, MCNanao, MHNguyen, LPlonowski, ASchulman, IGYan, GZhang, HHou, XValente, MNNarayanan, RBehnia, KRodrigues, ADBrock, BSmalley, JCantor, GHLupisella, JSleph, PGrimm, DOstrowski, JWexler, RRKirchgessner, TMohan, R Discovery of Highly Potent Liver X Receptorß Agonists. ACS Med Chem Lett7:1207-1212 (2016) 
 
Oxysterols receptor LXR-alpha
Name:Oxysterols receptor LXR-alpha
Type:Enzyme Catalytic Domain
Mol. Mass.:50403.85
Organism:Homo sapiens (Human)
Description:Q13133
Residue:447
BDBM50204074
NameBDBM50204074
Synonyms:CHEMBL3910597
TypeSmall organic molecule
Emp. Form.C29H28Cl3FN2O4S
Mol. Mass.625.966
SMILESCC(C)(O)c1cn(c(n1)C(C)(C)c1c(Cl)cccc1Cl)-c1ccc(cc1Cl)-c1cc(F)c(CO)c(c1)S(C)(=O)=O