Reaction Details
TargetOxysterols receptor LXR-alpha/Retinoic acid receptor RXR-alpha
LigandBDBM50204073
Substrate/Competitorn/a
Meas. Tech.ChEMBL_1626046 (CHEMBL3868515)
Ki 70±n/a nM
Citation Kick, EKBusch, BBMartin, RStevens, WCBollu, VXie, YBoren, BCNyman, MCNanao, MHNguyen, LPlonowski, ASchulman, IGYan, GZhang, HHou, XValente, MNNarayanan, RBehnia, KRodrigues, ADBrock, BSmalley, JCantor, GHLupisella, JSleph, PGrimm, DOstrowski, JWexler, RRKirchgessner, TMohan, R Discovery of Highly Potent Liver X Receptorß Agonists. ACS Med Chem Lett7:1207-1212 (2016) 
 
Oxysterols receptor LXR-alpha/Retinoic acid receptor RXR-alpha
Name:Oxysterols receptor LXR-alpha/Retinoic acid receptor RXR-alpha
Synonyms:Retinoic acid receptor RXR-alpha/oxysterols receptor LXR-alpha
Type:n/a
Mol. Mass.:n/a
Description:ASSAY_ID of ChEMBL is 2032721
Components:This complex has 2 components.
Component 1
Name:Retinoic acid receptor RXR-alpha
Type:PROTEIN
Mol. Mass.:50820.38
Organism:Homo sapiens (Human)
Description:ChEMBL_1456363
Residue:462
Component 2
Name:Oxysterols receptor LXR-alpha
Synonyms:LXRA Liver X receptor alpha Liver X receptor alpha (NR1H3) NR1H3 Nuclear orphan receptor LXR-alpha | Nuclear receptor subfamily 1 group H member 3
Type:Enzyme Catalytic Domain
Mol. Mass.:50403.85
Organism:Homo sapiens (Human)
Description:Q13133
Residue:447
BDBM50204073
NameBDBM50204073
Synonyms:CHEMBL3917300
TypeSmall organic molecule
Emp. Form.C29H28ClF3N2O4S
Mol. Mass.593.057
SMILESCC(C)(O)c1cn(c(n1)C(C)(C)c1c(F)cccc1Cl)-c1ccc(cc1F)-c1cc(F)c(CO)c(c1)S(C)(=O)=O