Reaction Details
TargetOxysterols receptor LXR-beta
LigandBDBM50204081
Substrate/Competitorn/a
Meas. Tech.ChEMBL_1626044 (CHEMBL3868513)
EC50 170±n/a nM
Citation Kick, EKBusch, BBMartin, RStevens, WCBollu, VXie, YBoren, BCNyman, MCNanao, MHNguyen, LPlonowski, ASchulman, IGYan, GZhang, HHou, XValente, MNNarayanan, RBehnia, KRodrigues, ADBrock, BSmalley, JCantor, GHLupisella, JSleph, PGrimm, DOstrowski, JWexler, RRKirchgessner, TMohan, R Discovery of Highly Potent Liver X Receptorß Agonists. ACS Med Chem Lett7:1207-1212 (2016) 
 
Oxysterols receptor LXR-beta
Name:Oxysterols receptor LXR-beta
Type:Enzyme Catalytic Domain
Mol. Mass.:50978.79
Organism:Homo sapiens (Human)
Description:P55055
Residue:460
BDBM50204081
NameBDBM50204081
Synonyms:CHEMBL3913162
TypeSmall organic molecule
Emp. Form.C29H31ClN2O4S
Mol. Mass.539.085
SMILESCC(C)(O)c1cn(c(n1)C(C)(C)c1ccccc1Cl)-c1ccc(cc1)-c1ccc(CO)c(c1)S(C)(=O)=O