Reaction Details
TargetOxysterols receptor LXR-beta
LigandBDBM50204079
Substrate/Competitorn/a
Meas. Tech.ChEMBL_1626044 (CHEMBL3868513)
EC50 42±n/a nM
Citation Kick, EKBusch, BBMartin, RStevens, WCBollu, VXie, YBoren, BCNyman, MCNanao, MHNguyen, LPlonowski, ASchulman, IGYan, GZhang, HHou, XValente, MNNarayanan, RBehnia, KRodrigues, ADBrock, BSmalley, JCantor, GHLupisella, JSleph, PGrimm, DOstrowski, JWexler, RRKirchgessner, TMohan, R Discovery of Highly Potent Liver X Receptorß Agonists. ACS Med Chem Lett7:1207-1212 (2016) 
 
Oxysterols receptor LXR-beta
Name:Oxysterols receptor LXR-beta
Type:Enzyme Catalytic Domain
Mol. Mass.:50978.79
Organism:Homo sapiens (Human)
Description:P55055
Residue:460
BDBM50204079
NameBDBM50204079
Synonyms:CHEMBL3935187
TypeSmall organic molecule
Emp. Form.C29H29Cl2FN2O4S
Mol. Mass.591.521
SMILESCC(C)(O)c1cn(c(n1)C(C)(C)c1c(Cl)cccc1Cl)-c1ccc(cc1)-c1cc(F)c(CO)c(c1)S(C)(=O)=O